Uploaded image for project: 'OpenAM'
  1. OpenAM
  2. OPENAM-10043

Failing unit test ThreadMonitorTest

    Details

    • Type: Bug
    • Status: Resolved
    • Priority: Blocker
    • Resolution: Fixed
    • Affects Version/s: 14.0.0
    • Fix Version/s: 13.5.1, 14.0.0
    • Component/s: other
    • Labels:
    • Sprint:
      Sprint 117 - Team Newton

      Description

      The ThreadMonitorTest#shouldIncrementRecoveryDelay looks intermittent. Investigate and resolve the cause of this intermittency.

      Running TestSuite
      Tests run: 1164, Failures: 1, Errors: 0, Skipped: 0, Time elapsed: 8.034 sec <<< FAILURE! - in TestSuite
      shouldIncrementRecoveryDelay(org.forgerock.openam.shared.concurrency.ThreadMonitorTest)  Time elapsed: 0.013 sec  <<< FAILURE!
      java.lang.AssertionError: Expected an increase to 3 of successiveFailingCounter. expected [3] but found [4]
      	at org.testng.Assert.fail(Assert.java:94)
      	at org.testng.Assert.failNotEquals(Assert.java:513)
      	at org.testng.Assert.assertEqualsImpl(Assert.java:135)
      	at org.testng.Assert.assertEquals(Assert.java:116)
      	at org.testng.Assert.assertEquals(Assert.java:389)
      	at org.forgerock.openam.shared.concurrency.ThreadMonitorTest.shouldIncrementRecoveryDelay(ThreadMonitorTest.java:204)
      Results :
      Failed tests: 
        ThreadMonitorTest.shouldIncrementRecoveryDelay:204 Expected an increase to 3 of successiveFailingCounter. expected [3] but found [4]
      

        Attachments

          Issue Links

            Activity

              People

              • Assignee:
                rwapshott Robert Wapshott
                Reporter:
                rwapshott Robert Wapshott
              • Votes:
                0 Vote for this issue
                Watchers:
                1 Start watching this issue

                Dates

                • Created:
                  Updated:
                  Resolved: